compiling problem for 0.47

9 Aug
2010
9 Aug
'10
7:58 a.m.
eraser-context.cpp: In function ‘void set_to_accumulated(SPEraserContext*)’: eraser-context.cpp:752:55: error: ‘r’ was not declared in this scope make[2]: *** [eraser-context.o] Ошибка 1
OS SuSE-11.3

9 Aug
9 Aug
8:42 a.m.
On 9/8/10 09:58, Нурминский Е.А. wrote:
eraser-context.cpp: In function ‘void set_to_accumulated(SPEraserContext*)’: eraser-context.cpp:752:55: error: ‘r’ was not declared in this scope make[2]: *** [eraser-context.o] Ошибка 1
see Bug #522327 “Inkscape 0.47 fails to build with GCC 4.5”: https://bugs.launchpad.net/inkscape/+bug/522327
~suv
5352
Age (days ago)
5352
Last active (days ago)
1 comments
2 participants
participants (2)
-
~suv
-
Нурминский Е.А.